Target
Retinoic acid receptor RXR-beta
Ligand
BDBM50122350
Substrate
Meas. Tech.
ChEMBL_197069 (CHEMBL806658)
Kd
7±n/a nM
Citation
 Farmer, LJZhi, LJeong, SLamph, WWOsburn, DLCroston, GFlatten, KSHeyman, RANadzan, AM Retinoic acid receptor ligands based on the 6-cyclopropyl-2,4-hexadienoic acid. Bioorg Med Chem Lett 13:261-4 (2002)  
Target
Name:
Retinoic acid receptor RXR-beta
Synonyms:
Nr2b2 Retinoid X receptor beta | Rxrb
Type:
PROTEIN
Mol. Mass.:
55877.78
Organism:
Mus musculus
Description:
ChEMBL_196588
Residue:
520
  
Inhibitor
Name:
BDBM50122350
Synonyms:
(2E,4E)-3-Methyl-6-[1-(5,5,8,8-tetramethyl-5,6,7,8-tetrahydro-naphthalen-2-yl)-cyclopentyl]-hexa-2,4-dienoic acid | CHEMBL90674
Type:
Small organic molecule
Emp. Form.:
C26H36O2
Mol. Mass.:
380.5628
SMILES:
C\C(\C=C\CC1(CCCC1)c1ccc2c(c1)C(C)(C)CCC2(C)C)=C/C(O)=O
: