Target
Retinoic acid receptor beta
Ligand
BDBM50122349
Substrate
Meas. Tech.
ChEBML_195488
Kd
>1000±n/a nM
Citation
 Farmer, LJZhi, LJeong, SLamph, WWOsburn, DLCroston, GFlatten, KSHeyman, RANadzan, AM Retinoic acid receptor ligands based on the 6-cyclopropyl-2,4-hexadienoic acid. Bioorg Med Chem Lett 13:261-4 (2002)  
Target
Name:
Retinoic acid receptor beta
Synonyms:
HAP NR1B2 RAR-beta RARB Retinoic acid receptor RXR-alpha/Retinoic acid receptor beta Retinoid receptor
Type:
PROTEIN
Mol. Mass.:
50498.70
Organism:
Homo sapiens (Human)
Description:
ChEMBL_1458015
Residue:
455
  
Inhibitor
Name:
BDBM50122349
Synonyms:
(2E,4E)-6-[1-(6-tert-Butyl-1,1-dimethyl-indan-4-yl)-cyclopropyl]-3-methyl-hexa-2,4-dienoic acid | CHEMBL88216
Type:
Small organic molecule
Emp. Form.:
C25H34O2
Mol. Mass.:
366.5363
SMILES:
C\C(\C=C\CC1(CC1)c1cc(cc2c1CCC2(C)C)C(C)(C)C)=C/C(O)=O
: