Target
5-hydroxytryptamine receptor 1A
Ligand
BDBM50122423
Substrate
Meas. Tech.
ChEBML_1232
IC50
6.7±n/a nM
Citation
 Mattson, RJCatt, JDSloan, CPGao, QCarter, RBGentile, AMahle, CDMatos, FFMcGovern, RVanderMaelen, CPYocca, FD Development of a presynaptic 5-HT1A antagonist. Bioorg Med Chem Lett 13:285-8 (2002)  
Target
Name:
5-hydroxytryptamine receptor 1A
Synonyms:
5-HT-1A 5-HT1A 5-hydroxytryptamine receptor 1A (5HT1A) 5ht1a Htr1a Serotonin 1a (5-HT1a) receptor/Adrenergic receptor alpha-1 | Serotonin receptor 1A
Type:
G Protein-Coupled Receptor (GPCR)
Mol. Mass.:
46445.29
Organism:
Rattus norvegicus (rat)
Description:
Binding assays were performed using rat hippocampal membranes.
Residue:
422
  
Inhibitor
Name:
BDBM50122423
Synonyms:
1-Benzo[1,3]dioxol-5-yl-4-[4-(3-ethoxy-benzyl)-piperazin-1-yl]-cyclohexanol | CHEMBL98984
Type:
Small organic molecule
Emp. Form.:
C26H34N2O4
Mol. Mass.:
438.5592
SMILES:
CCOc1cccc(CN2CCN(CC2)C2CCC(O)(CC2)c2ccc3OCOc3c2)c1
: