Target
5-hydroxytryptamine receptor 3A
Ligand
BDBM50122411
Substrate
Meas. Tech.
ChEBML_3062
IC50
>100000±n/a nM
Citation
 Mattson, RJCatt, JDSloan, CPGao, QCarter, RBGentile, AMahle, CDMatos, FFMcGovern, RVanderMaelen, CPYocca, FD Development of a presynaptic 5-HT1A antagonist. Bioorg Med Chem Lett 13:285-8 (2002)  
Target
Name:
5-hydroxytryptamine receptor 3A
Synonyms:
5-HT-3 5-HT3A 5-hydroxytryptamine receptor 3 (5-HT3) 5-hydroxytryptamine receptor 3A (5HT3A) 5HT3R HTR3A Serotonin 3 receptor (5HT3) Serotonin-gated ion channel receptor | Serotonin-gated ion channel receptor 3
Type:
Protein
Mol. Mass.:
55283.27
Organism:
Homo sapiens (Human)
Description:
P46098
Residue:
478
  
Inhibitor
Name:
BDBM50122411
Synonyms:
1-Benzo[1,3]dioxol-5-yl-4-[4-(3-methoxy-benzyl)-piperazin-1-yl]-cyclohexanol | CHEMBL100086
Type:
Small organic molecule
Emp. Form.:
C25H32N2O4
Mol. Mass.:
424.5326
SMILES:
COc1cccc(CN2CCN(CC2)C2CCC(O)(CC2)c2ccc3OCOc3c2)c1
: