Target
5-hydroxytryptamine receptor 1A
Ligand
BDBM50122437
Substrate
Meas. Tech.
ChEBML_1232
IC50
2.6±n/a nM
Citation
 Mattson, RJCatt, JDSloan, CPGao, QCarter, RBGentile, AMahle, CDMatos, FFMcGovern, RVanderMaelen, CPYocca, FD Development of a presynaptic 5-HT1A antagonist. Bioorg Med Chem Lett 13:285-8 (2002)  
Target
Name:
5-hydroxytryptamine receptor 1A
Synonyms:
5-HT-1A 5-HT1A 5-hydroxytryptamine receptor 1A (5HT1A) 5ht1a Htr1a Serotonin 1a (5-HT1a) receptor/Adrenergic receptor alpha-1 | Serotonin receptor 1A
Type:
G Protein-Coupled Receptor (GPCR)
Mol. Mass.:
46445.29
Organism:
Rattus norvegicus (rat)
Description:
Binding assays were performed using rat hippocampal membranes.
Residue:
422
  
Inhibitor
Name:
BDBM50122437
Synonyms:
1-Benzo[1,3]dioxol-5-yl-4-[4-(2,5-difluoro-benzyl)-piperazin-1-yl]-cyclohexanol | CHEMBL319368
Type:
Small organic molecule
Emp. Form.:
C24H28F2N2O3
Mol. Mass.:
430.4875
SMILES:
OC1(CCC(CC1)N1CCN(Cc2cc(F)ccc2F)CC1)c1ccc2OCOc2c1
: