Target
Serotonin 2 (5-HT2) receptor
Ligand
BDBM50122411
Substrate
Meas. Tech.
ChEMBL_1936 (CHEMBL617244)
IC50
28000±n/a nM
Citation
 Mattson, RJCatt, JDSloan, CPGao, QCarter, RBGentile, AMahle, CDMatos, FFMcGovern, RVanderMaelen, CPYocca, FD Development of a presynaptic 5-HT1A antagonist. Bioorg Med Chem Lett 13:285-8 (2002)  
Target
Name:
Serotonin 2 (5-HT2) receptor
Synonyms:
5-hydroxytryptamine receptor 2A/2B/2C
Type:
Mol. Mass.:
Description:
ASSAY_ID of ChEMBL is 2197419
Components:
This complex has 3 components.
Component 1
Name:
5-hydroxytryptamine receptor 2B
Synonyms:
5-HT2B 5HT2B_RAT Serotonin 2b (5-HT2b) receptor Srl
Type:
Enzyme Catalytic Domain
Mol. Mass.:
53668.47
Organism:
RAT
Description:
5-HT2B HTR2B RAT::P30994
Residue:
479
  
Component 2
Name:
5-hydroxytryptamine receptor 2C
Synonyms:
5-HT2C 5-hydroxytryptamine receptor 2C (5HT2c) 5ht1c Htr2c Serotonin receptor 2a and 2c (5HT2A and 5HT2C)
Type:
Enzyme
Mol. Mass.:
51935.10
Organism:
Rattus norvegicus (Rat)
Description:
P08909
Residue:
460
  
Component 3
Name:
5-hydroxytryptamine receptor 2A
Synonyms:
5-HT-2A 5-HT2A 5-hydroxytryptamine receptor 2A (5HT2A) Htr2 Serotonin Receptor 2A
Type:
G Protein-Coupled Receptor (GPCR)
Mol. Mass.:
52852.05
Organism:
Rattus norvegicus (rat)
Description:
Rat cortex membranes 5-HT2A receptors.
Residue:
471
  
Inhibitor
Name:
BDBM50122411
Synonyms:
1-Benzo[1,3]dioxol-5-yl-4-[4-(3-methoxy-benzyl)-piperazin-1-yl]-cyclohexanol | CHEMBL100086
Type:
Small organic molecule
Emp. Form.:
C25H32N2O4
Mol. Mass.:
424.5326
SMILES:
COc1cccc(CN2CCN(CC2)C2CCC(O)(CC2)c2ccc3OCOc3c2)c1
: