Target
Mitogen-activated protein kinase 14
Ligand
BDBM50384367
Substrate
Meas. Tech.
ChEMBL_2071704 (CHEMBL4727238)
IC50
50±n/a nM
Citation
 Raubo, PEvans, RWillis, P The discovery and evaluation of 3-amino-2(1H)-pyrazinones as a novel series of selective p38? MAP kinase inhibitors. Bioorg Med Chem Lett 30:0 (2020)  
Target
Name:
Mitogen-activated protein kinase 14
Synonyms:
CSAID-binding protein CSBP1 CSPB1 MAP kinase 14 MAP kinase p38 alpha MAPK14 MK14_HUMAN Mitogen-activated protein kinase p38 alpha Stress-activated protein kinase 2a | p38 MAP kinase alpha/beta
Type:
Serine/threonine-protein kinase
Mol. Mass.:
41286.76
Organism:
Homo sapiens (Human)
Description:
Q16539
Residue:
360
  
Inhibitor
Name:
BDBM50384367
Synonyms:
CHEMBL2031465
Type:
Small organic molecule
Emp. Form.:
C24H27N5O2
Mol. Mass.:
417.5035
SMILES:
CN1CCN(CC1)c1ccc2ncn(-c3cc(ccc3C)C(=O)NC3CC3)c(=O)c2c1
: