Target
Sodium/glucose cotransporter 1
Ligand
BDBM50560402
Substrate
Meas. Tech.
ChEMBL_2072104 (CHEMBL4727638)
IC50
0.500000±n/a nM
Citation
 Xu, GDu, FKuo, GHXu, JZLiang, YDemarest, KGaul, MD 5,5-Difluoro- and 5-Fluoro-5-methyl-hexose-based C-Glucosides as potent and orally bioavailable SGLT1 and SGLT2 dual inhibitors. Bioorg Med Chem Lett 30:0 (2020)  
Target
Name:
Sodium/glucose cotransporter 1
Synonyms:
High affinity sodium-glucose cotransporter Na(+)/glucose cotransporter 1 SGLT1 Sodium-dependent glucose cotransporter 1 (SGLT1) Sodium/glucose cotransporter 1 (SGLT1) | Solute carrier family 5 member 1
Type:
Protein
Mol. Mass.:
73503.78
Organism:
Homo sapiens (Human)
Description:
P13866
Residue:
664
  
Inhibitor
Name:
BDBM50560402
Synonyms:
LIK-066 Lik066 | USRE49080, Example 62
Type:
Small organic molecule
Emp. Form.:
C23H28O7
Mol. Mass.:
416.4642
SMILES:
CCc1ccc(cc1Cc1ccc2OCCOc2c1)[C@@H]1O[C@H](CO)[C@@H](O)[C@H](O)[C@H]1O
: