Target
Nuclear receptor subfamily 1 group D member 1
Ligand
BDBM50434039
Substrate
Meas. Tech.
ChEMBL_2072143 (CHEMBL4727677)
EC50
200±n/a nM
Citation
 Uriz-Huarte, ADate, AAng, HAli, SBrady, HJMFuchter, MJ The transcriptional repressor REV-ERB as a novel target for disease. Bioorg Med Chem Lett 30:0 (2020)  
Target
Name:
Nuclear receptor subfamily 1 group D member 1
Synonyms:
EAR-1 HREV NR1D1_HUMAN THRAL | V-erbA-related protein 1
Type:
PROTEIN
Mol. Mass.:
66822.11
Organism:
Homo sapiens (Human)
Description:
ChEMBL_958222
Residue:
614
  
Inhibitor
Name:
BDBM50434039
Synonyms:
CHEMBL2381193
Type:
Small organic molecule
Emp. Form.:
C19H15F2N3S
Mol. Mass.:
355.404
SMILES:
Fc1ccc(CN(Cc2ccc(s2)C#N)Cc2cccnc2)cc1F
: