Target
Thyroid hormone receptor alpha
Ligand
BDBM50123044
Substrate
Meas. Tech.
ChEBML_210487
EC50
12±n/a nM
Citation
 Dow, RLSchneider, SRPaight, ESHank, RFChiang, PCornelius, PLee, ENewsome, WPSwick, AGSpitzer, JHargrove, DMPatterson, TAPandit, JChrunyk, BALeMotte, PKDanley, DERosner, MHAmmirati, MJSimons, SPSchulte, GKTate, BFDaSilva-Jardine, P Discovery of a novel series of 6-azauracil-based thyroid hormone receptor ligands: potent, TR beta subtype-selective thyromimetics. Bioorg Med Chem Lett 13:379-82 (2003)  
Target
Name:
Thyroid hormone receptor alpha
Synonyms:
C-erbA-alpha EAR7 NR1A1 THA_HUMAN THRA1 Thyroid Hormone Receptor (TR-alpha) Thyroid hormone receptor alpha c-erbA-1
Type:
Receptor
Mol. Mass.:
54818.00
Organism:
Homo sapiens (Human)
Description:
Recombinant hThR was obtained from nuclear extracts from SF9 cells infected with baculovirus vectors encoding for ThRalpha 1.
Residue:
490
  
Inhibitor
Name:
BDBM50123044
Synonyms:
5-(2,6-dichloro-4-(3,5-dioxo-4,5-dihydro-1,2,4-triazin-2(3H)-yl)phenoxy)-N-(6,6-dimethylbicyclo[3.1.1]heptan-2-yl)-2-hydroxybenzamide CHEMBL124205
Type:
Small organic molecule
Emp. Form.:
C25H24Cl2N4O5
Mol. Mass.:
531.388
SMILES:
CC1(C)C2CC1C(CC2)NC(=O)c1cc(Oc2c(Cl)cc(cc2Cl)-n2ncc(=O)[nH]c2=O)ccc1O
: