Target
Chorismate synthase
Ligand
BDBM50123089
Substrate
Meas. Tech.
ChEBML_49434
IC50
2000±n/a nM
Citation
 Thomas, MGLawson, CAllanson, NMLeslie, BWBottomley, JRMcBride, AOlusanya, OA A series of 2(Z)-2-benzylidene-6,7-dihydroxybenzofuran-3[2H]-ones as inhibitors of chorismate synthase. Bioorg Med Chem Lett 13:423-6 (2003)  
Target
Name:
Chorismate synthase
Synonyms:
AROC_STRPN | aroC
Type:
PROTEIN
Mol. Mass.:
42869.22
Organism:
Streptococcus pneumoniae
Description:
ChEMBL_49433
Residue:
388
  
Inhibitor
Name:
BDBM50123089
Synonyms:
6,7-Dihydroxy-2-[1-(2-nitro-phenyl)-meth-(E)-ylidene]-benzofuran-3-one | CHEMBL134411
Type:
Small organic molecule
Emp. Form.:
C15H9NO6
Mol. Mass.:
299.2351
SMILES:
Oc1ccc2C(=O)\C(Oc2c1O)=C/c1ccccc1[N+]([O-])=O
: