Target
Small conductance calcium-activated potassium channel protein 2
Ligand
BDBM50561184
Substrate
Meas. Tech.
ChEMBL_2074320 (CHEMBL4729854)
EC50
0.290000±n/a nM
Citation
 Mayorga-Flores, MChantôme, AMelchor-Meneses, CMDomingo, ITitaux-Delgado, GAGalindo-Murillo, RVandier, CDel Río-Portilla, F Novel Blocker of Onco SK3 Channels Derived from Scorpion Toxin Tamapin and Active against Migration of Cancer Cells. ACS Med Chem Lett 11:1627-1633 (2020)  
Target
Name:
Small conductance calcium-activated potassium channel protein 2
Synonyms:
KCNN2_RAT Small conductance calcium-activated potassium channel Small conductance calcium-activated potassium channel protein 2 (KCa2.2)
Type:
Protein
Mol. Mass.:
63876.72
Organism:
Rattus norvegicus (Rat)
Description:
P70604
Residue:
580
  
Inhibitor
Name:
BDBM50561184
Synonyms:
CHEMBL4762592
Type:
Small organic molecule
Emp. Form.:
C142H236N44O40S7
Mol. Mass.:
3424.119
SMILES:
CC[C@H](C)[C@@H]1NC(=O)[C@@H]2CSSC[C@H](NC(=O)[C@H](Cc3ccccc3)NC(=O)[C@H](C)N)C(=O)N[C@@H](CC(N)=O)C(=O)N[C@@H](CC(C)C)C(=O)N[C@@H](CCCNC(N)=N)C(=O)N[C@@H](CCSC)C(=O)N[C@H]3CSSC[C@H](NC(=O)[C@H](CCCCN)NC(=O)[C@H](CC(O)=O)NC(=O)CNC1=O)C(=O)N[C@@H](CCC(O)=O)C(=O)N[C@@H](CSSC[C@H](NC(=O)[C@H](CO)NC(=O)[C@H](CC(C)C)NC(=O)[C@H](CCC(N)=O)NC3=O)C(=O)N[C@@H](CCCNC(N)=N)C(=O)N[C@@H](CO)C(=O)N[C@@H](CC(C)C)C(=O)NCC(=O)N[C@@H](CC(C)C)C(=O)N[C@@H](CC(C)C)C(=O)NCC(=O)N[C@@H](CCCCN)C(=O)N2)C(=O)N[C@@H](C(C)C)C(=O)N[C@@H](CCCCN)C(=O)N[C@@H](Cc1c[nH]cn1)C(O)=O
: