Target
UDP-glucuronosyltransferase 2B15
Ligand
BDBM50561654
Substrate
Meas. Tech.
ChEMBL_2075690 (CHEMBL4731224)
IC50
>10000±n/a nM
Citation
 Thurairatnam, SLim, SBarker, RHChoi-Sledeski, YMHirth, BHJiang, JMacor, JEMakino, EManiar, SMusick, KPribish, JRMunson, M Brain Penetrable Inhibitors of Ceramide Galactosyltransferase for the Treatment of Lysosomal Storage Disorders. ACS Med Chem Lett 11:2010-2016 (2020)  
Target
Name:
UDP-glucuronosyltransferase 2B15
Synonyms:
2.4.1.17 Synonyms=UGT2B8 UDP-glucuronosyltransferase 2B15 UDPGT 2B15 UDPGTh-3 UGT2B8
Type:
PROTEIN
Mol. Mass.:
61054.27
Organism:
Homo sapiens
Description:
ChEMBL_119702
Residue:
530
  
Inhibitor
Name:
BDBM50561654
Synonyms:
CHEMBL4785914
Type:
Small organic molecule
Emp. Form.:
C20H22F6N4O4S
Mol. Mass.:
528.468
SMILES:
CNC(=O)c1csc2c(cc(nc12)N1CCC(CC1)OC(=O)N[C@@H](C)COC(F)(F)F)C(F)(F)F
: