Target
Progesterone receptor
Ligand
BDBM50124595
Substrate
Meas. Tech.
ChEBML_159729
Ki
7.6±n/a nM
Citation
 Kym, PRKort, MECoghlan, MJMoore, JLTang, RRatajczyk, JDLarson, DPElmore, SWPratt, JKStashko, MAFalls, HDLin, CWNakane, MMiller, LTyree, CMMiner, JNJacobson, PBWilcox, DMNguyen, PLane, BC Nonsteroidal selective glucocorticoid modulators: the effect of C-10 substitution on receptor selectivity and functional potency of 5-allyl-2,5-dihydro-2,2,4-trimethyl-1H-[1]benzopyrano[3,4-f]quinolines. J Med Chem 46:1016-30 (2003)  
Target
Name:
Progesterone receptor
Synonyms:
NR3C3 PGR PRGR_HUMAN | progesterone
Type:
Protein
Mol. Mass.:
98979.52
Organism:
Homo sapiens (Human)
Description:
P06401
Residue:
933
  
Inhibitor
Name:
BDBM50124595
Synonyms:
5-Allyl-10-chloro-2,2,4-trimethyl-2,5-dihydro-1H-6-oxa-1-aza-chrysen-9-ol | CHEMBL273658
Type:
Small organic molecule
Emp. Form.:
C22H22ClNO2
Mol. Mass.:
367.869
SMILES:
CC1=CC(C)(C)Nc2ccc-3c(C(CC=C)Oc4ccc(O)c(Cl)c-34)c12
: