Target
Endothelin-1 receptor
Ligand
BDBM50125362
Substrate
Meas. Tech.
ChEBML_65644
Ki
7±n/a nM
Citation
 Tellew, JEBaska, RABeyer, SMCarlson, KECornelius, LAFadnis, LGu, ZKunst, BLKowala, MCMonshizadegan, HMurugesan, NRyan, CSValentine, MTYang, YMacor, JE Discovery of 4'-[(imidazol-1-yl)methyl]biphenyl-2-sulfonamides as dual endothelin/angiotensin II receptor antagonists. Bioorg Med Chem Lett 13:1093-6 (2003)  
Target
Name:
Endothelin-1 receptor
Synonyms:
EDNRA ET-A ETA-R Endothelin receptor type A hET-AR
Type:
Enzyme Catalytic Domain
Mol. Mass.:
48736.88
Organism:
Homo sapiens (Human)
Description:
P25101
Residue:
427
  
Inhibitor
Name:
BDBM50125362
Synonyms:
3-[2'-(3,4-Dimethyl-isoxazol-5-ylsulfamoyl)-2-ethyl-biphenyl-4-ylmethyl]-5-ethyl-2-propyl-3H-imidazole-4-carboxylic acid amide | CHEMBL12233
Type:
Small organic molecule
Emp. Form.:
C29H35N5O4S
Mol. Mass.:
549.684
SMILES:
CCCc1nc(CC)c(C(N)=O)n1Cc1ccc(c(CC)c1)-c1ccccc1S(=O)(=O)Nc1onc(C)c1C
: