Target
Type-1 angiotensin II receptor A/B
Ligand
BDBM50125362
Substrate
Meas. Tech.
ChEMBL_35111 (CHEMBL649313)
Ki
1.3±n/a nM
Citation
 Tellew, JEBaska, RABeyer, SMCarlson, KECornelius, LAFadnis, LGu, ZKunst, BLKowala, MCMonshizadegan, HMurugesan, NRyan, CSValentine, MTYang, YMacor, JE Discovery of 4'-[(imidazol-1-yl)methyl]biphenyl-2-sulfonamides as dual endothelin/angiotensin II receptor antagonists. Bioorg Med Chem Lett 13:1093-6 (2003)  
Target
Name:
Type-1 angiotensin II receptor A/B
Synonyms:
Angiotensin II receptor (AT-1) type-1 | Type-1A/Type-1B angiotensin II receptor
Type:
Mol. Mass.:
Description:
ASSAY_ID of ChEMBL is 901964
Components:
This complex has 2 components.
Component 1
Name:
Type-1 angiotensin II receptor B
Synonyms:
AGTRB_RAT Agtr1 Angiotensin II AT1B Angiotensin II type 1b (AT-1b) receptor Type-1B angiotensin II receptor
Type:
Enzyme Catalytic Domain
Mol. Mass.:
40929.44
Organism:
RAT
Description:
Angiotensin II AT1B 0 RAT::P29089
Residue:
359
  
Component 2
Name:
Type-1 angiotensin II receptor A
Synonyms:
AGTRA_RAT Agtr1 Angiotensin II AT1 Angiotensin II receptor (AT-1) type-1 Type-1A angiotensin II receptor
Type:
Enzyme Catalytic Domain
Mol. Mass.:
40910.53
Organism:
RAT
Description:
ANGIOTENSIN AT1 AGTR1 RAT::P25095
Residue:
359
  
Inhibitor
Name:
BDBM50125362
Synonyms:
3-[2'-(3,4-Dimethyl-isoxazol-5-ylsulfamoyl)-2-ethyl-biphenyl-4-ylmethyl]-5-ethyl-2-propyl-3H-imidazole-4-carboxylic acid amide | CHEMBL12233
Type:
Small organic molecule
Emp. Form.:
C29H35N5O4S
Mol. Mass.:
549.684
SMILES:
CCCc1nc(CC)c(C(N)=O)n1Cc1ccc(c(CC)c1)-c1ccccc1S(=O)(=O)Nc1onc(C)c1C
: