Target
Acetylcholinesterase
Ligand
BDBM50125781
Substrate
Meas. Tech.
ChEMBL_29222 (CHEMBL641388)
IC50
3100±n/a nM
Citation
 Barreiro, EJCamara, CAVerli, HBrazil-Más, LCastro, NGCintra, WMAracava, YRodrigues, CRFraga, CA Design, synthesis, and pharmacological profile of novel fused pyrazolo[4,3-d]pyridine and pyrazolo[3,4-b][1,8]naphthyridine isosteres: a new class of potent and selective acetylcholinesterase inhibitors. J Med Chem 46:1144-52 (2003)  
Target
Name:
Acetylcholinesterase
Synonyms:
ACES_RAT Acetylcholinesterase and butyrylcholinesterase (AChE and BChE) Acetylcholinesterase, AChE | Ache
Type:
Enzyme
Mol. Mass.:
68193.62
Organism:
Rattus norvegicus (rat)
Description:
P37136
Residue:
614
  
Inhibitor
Name:
BDBM50125781
Synonyms:
9-methoxy-4-methyl-(1R,12S,14R)-4-azatetracyclo[8.6.1.01,12.06,17]heptadeca-6,8,10(17),15-tetraen-14-ol | CHEMBL15576
Type:
Small organic molecule
Emp. Form.:
C18H23NO2
Mol. Mass.:
285.3807
SMILES:
COc1ccc2CN(C)CCC34C=C[C@H](O)C[C@@H]3Cc1c24
: