Target
Protein farnesyltransferase subunit beta/geranylgeranyltransferase type-1 subunit alpha
Ligand
BDBM16181
Substrate
Meas. Tech.
ChEMBL_38702 (CHEMBL651598)
EC50
4±n/a nM
Citation
 Gwaltney, SLO'Connor, SJNelson, LTSullivan, GMImade, HWang, WHasvold, LLi, QCohen, JGu, WZTahir, SKBauch, JMarsh, KNg, SCFrost, DJZhang, HMuchmore, SJakob, CGStoll, VHutchins, CRosenberg, SHSham, HL Aryl tetrahydropyridine inhibitors of farnesyltransferase: bioavailable analogues with improved cellular potency. Bioorg Med Chem Lett 13:1363-6 (2003)  
Target
Name:
Protein farnesyltransferase subunit beta/geranylgeranyltransferase type-1 subunit alpha
Synonyms:
Protein farnesyltransferase | Protein farnesyltransferase beta/geranylgeranyltransferase type I alpha subunit
Type:
Mol. Mass.:
Description:
ASSAY_ID of EBI is 38702
Components:
This complex has 2 components.
Component 1
Name:
Protein farnesyltransferase/geranylgeranyltransferase type-1 subunit alpha
Synonyms:
CAAX farnesyltransferase subunit alpha FTase-alpha GGTase-I-alpha Protein farnesyltransferase/geranylgeranyltransferase type-1 subunit alpha Type I protein geranyl-geranyltransferase subunit alpha
Type:
PROTEIN
Mol. Mass.:
43994.09
Organism:
Mus musculus
Description:
EBI_10570
Residue:
377
  
Component 2
Name:
Protein farnesyltransferase subunit beta
Synonyms:
FNTB_MOUSE Protein farnesyltransferase
Type:
PROTEIN
Mol. Mass.:
48811.61
Organism:
Mus musculus
Description:
EBI_12341
Residue:
437
  
Inhibitor
Name:
BDBM16181
Synonyms:
1-[2-(4-cyanophenyl)-2-hydroxy-2-(1-methyl-1H-imidazol-5-yl)ethyl]-5-(naphthalen-1-yl)-1,2,3,6-tetrahydropyridine-4-carbonitrile A345677 | CHEMBL282161
Type:
Small organic molecule
Emp. Form.:
C29H25N5O
Mol. Mass.:
459.5417
SMILES:
Cn1cncc1C(O)(CN1CCC(C#N)=C(C1)c1cccc2ccccc12)c1ccc(cc1)C#N
: