Target
Protein farnesyltransferase subunit beta/geranylgeranyltransferase type-1 subunit alpha
Ligand
BDBM50126323
Substrate
Meas. Tech.
ChEBML_69990
IC50
1.4±n/a nM
Citation
 Gwaltney, SLO'Connor, SJNelson, LTSullivan, GMImade, HWang, WHasvold, LLi, QCohen, JGu, WZTahir, SKBauch, JMarsh, KNg, SCFrost, DJZhang, HMuchmore, SJakob, CGStoll, VHutchins, CRosenberg, SHSham, HL Aryl tetrahydropyridine inhibitors of farnesyltransferase: bioavailable analogues with improved cellular potency. Bioorg Med Chem Lett 13:1363-6 (2003)  
Target
Name:
Protein farnesyltransferase subunit beta/geranylgeranyltransferase type-1 subunit alpha
Synonyms:
Farnesyltransferase (FTase) Protein Farnesyltransferase (PFT) Chain B | Protein farnesyltransferase
Type:
Protein Complex
Mol. Mass.:
Description:
To express recombinant enzyme in E. coli, the cloned human alpha and beta subunits were co-expressed from a plasmid, in which their expression was translationally coupled.
Components:
This complex has 2 components.
Component 1
Name:
Protein farnesyltransferase subunit beta
Synonyms:
CAAX farnesyltransferase subunit alpha FNTB FTase-alpha GGTase-I-alpha Protein farnesyl/geranylgeranyl transferase Protein farnesyltransferase subunit beta Protein farnesyltransferase/geranylgeranyltransferase type-1 subunit alpha Ras proteins prenyltransferase subunit beta | Type I protein geranyl-geranyltransferase subunit alpha
Type:
Enzyme Subunit
Mol. Mass.:
48766.02
Organism:
Homo sapiens (Human)
Description:
Protein farnesyltransferase subunit beta
Residue:
437
  
Component 2
Name:
Protein farnesyltransferase/geranylgeranyltransferase type-1 subunit alpha
Synonyms:
CAAX farnesyltransferase alpha subunit FNTA_HUMAN FTase-alpha Geranylgeranyl Transferase (GGTase-I) Chain A Protein Farnesyltransferase (PFT) Chain A Protein farnesyltransferase Protein farnesyltransferase/geranylgeranyltransferase type I alpha subunit | Ras proteins prenyltransferase alpha
Type:
Enzyme
Mol. Mass.:
44392.46
Organism:
Homo sapiens (Human)
Description:
Recombinant human FTase.
Residue:
379
  
Inhibitor
Name:
BDBM50126323
Synonyms:
1-{3-[3-(4-Cyano-benzyl)-3H-imidazol-4-yl]-propionyl}-5-naphthalen-1-yl-1,2,3,6-tetrahydro-pyridine-4-carbonitrile | CHEMBL29633
Type:
Small organic molecule
Emp. Form.:
C30H25N5O
Mol. Mass.:
471.5524
SMILES:
O=C(CCc1cncn1Cc1ccc(cc1)C#N)N1CCC(C#N)=C(C1)c1cccc2ccccc12
: