Target
Protein farnesyltransferase subunit beta/geranylgeranyltransferase type-1 subunit alpha
Ligand
BDBM17335
Substrate
Meas. Tech.
ChEMBL_38702 (CHEMBL651598)
EC50
>100±n/a nM
Citation
 Gwaltney, SLO'Connor, SJNelson, LTSullivan, GMImade, HWang, WHasvold, LLi, QCohen, JGu, WZTahir, SKBauch, JMarsh, KNg, SCFrost, DJZhang, HMuchmore, SJakob, CGStoll, VHutchins, CRosenberg, SHSham, HL Aryl tetrahydropyridine inhibitors of farnesyltransferase: bioavailable analogues with improved cellular potency. Bioorg Med Chem Lett 13:1363-6 (2003)  
Target
Name:
Protein farnesyltransferase subunit beta/geranylgeranyltransferase type-1 subunit alpha
Synonyms:
Protein farnesyltransferase | Protein farnesyltransferase beta/geranylgeranyltransferase type I alpha subunit
Type:
Mol. Mass.:
Description:
ASSAY_ID of EBI is 38702
Components:
This complex has 2 components.
Component 1
Name:
Protein farnesyltransferase/geranylgeranyltransferase type-1 subunit alpha
Synonyms:
CAAX farnesyltransferase subunit alpha FTase-alpha GGTase-I-alpha Protein farnesyltransferase/geranylgeranyltransferase type-1 subunit alpha Type I protein geranyl-geranyltransferase subunit alpha
Type:
PROTEIN
Mol. Mass.:
43994.09
Organism:
Mus musculus
Description:
EBI_10570
Residue:
377
  
Component 2
Name:
Protein farnesyltransferase subunit beta
Synonyms:
FNTB_MOUSE Protein farnesyltransferase
Type:
PROTEIN
Mol. Mass.:
48811.61
Organism:
Mus musculus
Description:
EBI_12341
Residue:
437
  
Inhibitor
Name:
BDBM17335
Synonyms:
1-[(2R)-2-{[(4-cyanophenyl)methyl](methyl)amino}-3-(1-methyl-1H-imidazol-5-yl)propanoyl]-5-(naphthalen-1-yl)-1,2,3,6-tetrahydropyridine-4-carbonitrile histidine derivative, 37
Type:
Small organic molecule
Emp. Form.:
C32H30N6O
Mol. Mass.:
514.6202
SMILES:
CN(Cc1ccc(cc1)C#N)[C@H](Cc1cncn1C)C(=O)N1CCC(C#N)=C(C1)c1cccc2ccccc12
: