Target
Geranylgeranyl transferase type-1 subunit beta/Protein farnesyltransferase/geranylgeranyltransferase type-1 subunit alpha
Ligand
BDBM17335
Substrate
Meas. Tech.
ChEMBL_71955 (CHEMBL685886)
IC50
1600±n/a nM
Citation
 Gwaltney, SLO'Connor, SJNelson, LTSullivan, GMImade, HWang, WHasvold, LLi, QCohen, JGu, WZTahir, SKBauch, JMarsh, KNg, SCFrost, DJZhang, HMuchmore, SJakob, CGStoll, VHutchins, CRosenberg, SHSham, HL Aryl tetrahydropyridine inhibitors of farnesyltransferase: bioavailable analogues with improved cellular potency. Bioorg Med Chem Lett 13:1363-6 (2003)  
Target
Name:
Geranylgeranyl transferase type-1 subunit beta/Protein farnesyltransferase/geranylgeranyltransferase type-1 subunit alpha
Synonyms:
Geranylgeranyl transferase type I Geranylgeranyl transferase type I beta/Protein farnesyltransferase/geranylgeranyltransferase type I alpha subunit
Type:
Mol. Mass.:
Description:
ASSAY_ID of EBI is 70196
Components:
This complex has 2 components.
Component 1
Name:
Protein farnesyltransferase/geranylgeranyltransferase type-1 subunit alpha
Synonyms:
CAAX farnesyltransferase alpha subunit FNTA_HUMAN FTase-alpha Geranylgeranyl Transferase (GGTase-I) Chain A Protein Farnesyltransferase (PFT) Chain A Protein farnesyltransferase Protein farnesyltransferase/geranylgeranyltransferase type I alpha subunit | Ras proteins prenyltransferase alpha
Type:
Enzyme
Mol. Mass.:
44392.46
Organism:
Homo sapiens (Human)
Description:
Recombinant human FTase.
Residue:
379
  
Component 2
Name:
Geranylgeranyl transferase type-1 subunit beta
Synonyms:
2.5.1.59 Geranylgeranyl transferase type I Geranylgeranyl transferase type I subunit beta PGGT1B Protein farnesyl/geranylgeranyl transferase | Type I protein geranyl-geranyltransferase subunit beta
Type:
Mol. Mass.:
42369.84
Organism:
Homo sapiens (Human)
Description:
Residue:
377
  
Inhibitor
Name:
BDBM17335
Synonyms:
1-[(2R)-2-{[(4-cyanophenyl)methyl](methyl)amino}-3-(1-methyl-1H-imidazol-5-yl)propanoyl]-5-(naphthalen-1-yl)-1,2,3,6-tetrahydropyridine-4-carbonitrile histidine derivative, 37
Type:
Small organic molecule
Emp. Form.:
C32H30N6O
Mol. Mass.:
514.6202
SMILES:
CN(Cc1ccc(cc1)C#N)[C@H](Cc1cncn1C)C(=O)N1CCC(C#N)=C(C1)c1cccc2ccccc12
: