Target
Melanocortin receptor 4
Ligand
BDBM50126394
Substrate
Meas. Tech.
ChEBML_106348
IC50
>100000±n/a nM
Citation
 Thompson, DAChai, BXRood, HLSiani, MADouglas, NRGantz, IMillhauser, GL Peptoid mimics of agouti related protein. Bioorg Med Chem Lett 13:1409-13 (2003)  
Target
Name:
Melanocortin receptor 4
Synonyms:
MC4-R MC4R_HUMAN Melanocortin receptor 4 (MC-4) Melanocortin receptor 4 (MC4R)
Type:
Enzyme
Mol. Mass.:
36949.50
Organism:
Homo sapiens (Human)
Description:
P32245
Residue:
332
  
Inhibitor
Name:
BDBM50126394
Synonyms:
CHEMBL440102 | N-Benzyl-N-[(benzyl-carbamoylmethyl-carbamoyl)-methyl]-2-(3-guanidino-propylamino)-acetamide
Type:
Small organic molecule
Emp. Form.:
C24H33N7O3
Mol. Mass.:
467.5639
SMILES:
NC(=O)CN(Cc1ccccc1)C(=O)CN(Cc1ccccc1)C(=O)CNCCCNC(N)=N
: