Target
Histamine H3 receptor
Ligand
BDBM50562736
Substrate
Meas. Tech.
ChEMBL_2080122 (CHEMBL4735913)
IC50
0.460000±n/a nM
Citation
 Zhang, MTang, LJiang, LWei, JHu, YSheng, R Identification of N-phenyl-3-methoxy-4-pyridinones as orally bioavailable H Eur J Med Chem 212:0 (2021)  
Target
Name:
Histamine H3 receptor
Synonyms:
G-protein coupled receptor 97 HH3R HRH3 Histamine H3 receptor (H3) Histamine receptor (H3 and H4)
Type:
G Protein-Coupled Receptor (GPCR)
Mol. Mass.:
48691.47
Organism:
Homo sapiens (Human)
Description:
Binding assays were using CHO cells stably expressing hH3R receptors.
Residue:
445
  
Inhibitor
Name:
BDBM50562736
Synonyms:
CHEMBL4752329
Type:
Small organic molecule
Emp. Form.:
C22H28N2O3
Mol. Mass.:
368.4693
SMILES:
COc1cn(ccc1=O)-c1ccc(OC2CCN(CC2)C2CCCC2)cc1
: