Target
Sodium-dependent dopamine transporter
Ligand
BDBM50118602
Substrate
Meas. Tech.
ChEMBL_62334 (CHEMBL674427)
Ki
16±n/a nM
Citation
 Greiner, EPrisinzano, TJohnson II, EMDersch, CMMarcus, JPartilla, JSRothman, RBJacobson, AERice, KC Structure-activity relationship studies of highly selective inhibitors of the dopamine transporter: N-benzylpiperidine analogues of 1-[2-[bis(4-fluorophenyl)methoxy]ethyl]-4-(3-phenylpropyl)piperazine. J Med Chem 46:1465-9 (2003)  
Target
Name:
Sodium-dependent dopamine transporter
Synonyms:
DA transporter SC6A3_RAT Sodium-dependent dopamine transporter | Sodium-dependent dopamine transporter (DAT)
Type:
Multi-pass membrane protein
Mol. Mass.:
68749.45
Organism:
Rattus norvegicus (rat)
Description:
P23977
Residue:
619
  
Inhibitor
Name:
BDBM50118602
Synonyms:
4-(2-(bis(4-fluorophenyl)methoxy)ethyl)-1-(naphthalen-1-ylmethyl)piperidine CHEMBL35411
Type:
Small organic molecule
Emp. Form.:
C31H31F2NO
Mol. Mass.:
471.5807
SMILES:
Fc1ccc(cc1)C(OCCC1CCN(Cc2cccc3ccccc23)CC1)c1ccc(F)cc1
: