Target
Dihydrofolate reductase
Ligand
BDBM18511
Substrate
Meas. Tech.
ChEMBL_55103 (CHEMBL665363)
IC50
16±n/a nM
Citation
 Rosowsky, AForsch, RAQueener, SF Further studies on 2,4-diamino-5-(2',5'-disubstituted benzyl)pyrimidines as potent and selective inhibitors of dihydrofolate reductases from three major opportunistic pathogens of AIDS. J Med Chem 46:1726-36 (2003)  
Target
Name:
Dihydrofolate reductase
Synonyms:
Dihydrofolate reductase (DHFR) | Tetrahydrofolate dehydrogenase
Type:
Enzyme
Mol. Mass.:
19884.75
Organism:
Mycobacterium avium
Description:
Recombinant Mycobacterium avium DHFR expressed in E. coli.
Residue:
181
  
Inhibitor
Name:
BDBM18511
Synonyms:
6-{3-[(2,4-diaminopyrimidin-5-yl)methyl]-4-methoxyphenyl}hexanoic acid Diaminopyrimidine, 23
Type:
Small organic molecule
Emp. Form.:
C18H24N4O3
Mol. Mass.:
344.4082
SMILES:
COc1ccc(CCCCCC(O)=O)cc1Cc1cnc(N)nc1N
: