Target
72 kDa type IV collagenase
Ligand
BDBM50127451
Substrate
Meas. Tech.
ChEMBL_104404 (CHEMBL715007)
Ki
<2.8±n/a nM
Citation
 Cherney, RJDuan, JJVoss, MEChen, LWang, LMeyer, DTWasserman, ZRHardman, KDLiu, RQCovington, MBQian, MMandlekar, SChrist, DDTrzaskos, JMNewton, RCMagolda, RLWexler, RRDecicco, CP Design, synthesis, and evaluation of benzothiadiazepine hydroxamates as selective tumor necrosis factor-alpha converting enzyme inhibitors. J Med Chem 46:1811-23 (2003)  
Target
Name:
72 kDa type IV collagenase
Synonyms:
72 kDa gelatinase CLG4A Gelatinase A (MMP-2) MMP2_HUMAN Matrix metalloproteinase-2 (MMP 2) Matrix metalloproteinases 2 (MMP-2) | TBE-1
Type:
Enzyme
Mol. Mass.:
73870.36
Organism:
Homo sapiens (Human)
Description:
P08253
Residue:
660
  
Inhibitor
Name:
BDBM50127451
Synonyms:
CHEMBL53643 | N-Hydroxy-2-[7-(4-methoxy-phenoxy)-1,1-dioxo-1,3,4,5-tetrahydro-1lambda*6*-benzo[f][1,2,5]thiadiazepin-2-yl]-propionamide
Type:
Small organic molecule
Emp. Form.:
C18H21N3O6S
Mol. Mass.:
407.441
SMILES:
COc1ccc(Oc2ccc3c(NCCN([C@H](C)C(=O)NO)S3(=O)=O)c2)cc1
: