Target
Bombesin receptor subtype-3
Ligand
BDBM50127519
Substrate
Meas. Tech.
ChEMBL_39239 (CHEMBL655889)
EC50
151±n/a nM
Citation
 Weber, DBerger, CEickelmann, PAntel, JKessler, H Design of selective peptidomimetic agonists for the human orphan receptor BRS-3. J Med Chem 46:1918-30 (2003)  
Target
Name:
Bombesin receptor subtype-3
Synonyms:
BRS-3 BRS3_HUMAN Bombesin like receptor 3
Type:
Enzyme Catalytic Domain
Mol. Mass.:
44424.45
Organism:
Homo sapiens (Human)
Description:
Bombesin 3 BRS3 HUMAN::P32247
Residue:
399
  
Inhibitor
Name:
BDBM50127519
Synonyms:
CHEMBL262992 | [D-Tyr6-, Beta-Ala11, Phe13, Nle14] Bn (6-14)(Bombesin Analogue)
Type:
Small organic molecule
Emp. Form.:
C58H79N11O11
Mol. Mass.:
1106.315
SMILES:
CCCC[C@H](NC(=O)[C@H](Cc1ccccc1)NC(=O)[C@@H](NC(=O)CCNC(=O)[C@H](CC(C)C)NC(=O)[C@H](Cc1cnc[nH]1)NC(=O)[C@H](Cc1ccccc1)NC(=O)[C@@H]1CCCN1C(=O)[C@H](N)Cc1ccc(O)cc1)C(C)C)C(O)=O
: