Target
TGF-beta receptor type-1
Ligand
BDBM50015640
Substrate
Meas. Tech.
ChEMBL_2083392 (CHEMBL4739183)
IC50
129±n/a nM
Citation
 Liu, YYGuo, ZWang, JYWang, HMDa Qi, JMa, JPiao, HRJin, CHJin, X Synthesis and evaluation of the epithelial-to- mesenchymal inhibitory activity of indazole-derived imidazoles as dual ALK5/p38? MAP inhibitors. Eur J Med Chem 216:0 (2021)  
Target
Name:
TGF-beta receptor type-1
Synonyms:
ALK-5 Activin A receptor type II-like protein kinase of 53kD SKR4 TGF-beta receptor type I TGFBR1 TGFR1_HUMAN Transforming growth factor-beta receptor type I
Type:
enzyme
Mol. Mass.:
55968.24
Organism:
Homo sapiens (Human)
Description:
P36897
Residue:
503
  
Inhibitor
Name:
BDBM50015640
Synonyms:
GALUNISERTIB | LY-2157299
Type:
Small organic molecule
Emp. Form.:
C22H19N5O
Mol. Mass.:
369.4192
SMILES:
Cc1cccc(n1)-c1nn2CCCc2c1-c1ccnc2ccc(cc12)C(N)=O
: