Target
ATP-sensitive inward rectifier potassium channel 11
Ligand
BDBM50127784
Substrate
Meas. Tech.
ChEBML_92724
EC50
160±n/a nM
Citation
 Turner, SCCarroll, WAWhite, TKBrune, MEBuckner, SAGopalakrishnan, MFabiyi, ACoghlan, MJScott, VECastle, NADaza, AVMilicic, ISullivan, JP Structure-activity relationship of a novel class of naphthyl amide KATP channel openers. Bioorg Med Chem Lett 13:1741-4 (2003)  
Target
Name:
ATP-sensitive inward rectifier potassium channel 11
Synonyms:
ATP-sensitive inward rectifier potassium channel 11 Inward rectifier K(+) channel Kir6.2 KCNJ11 Potassium channel, inwardly rectifying, subfamily J, member 11 Sulfonylurea receptor 2, Kir6.2
Type:
Enzyme Catalytic Domain
Mol. Mass.:
43549.41
Organism:
Homo sapiens (Human)
Description:
Potassium channel (ATP modulatory) 0 0::Q14654
Residue:
390
  
Inhibitor
Name:
BDBM50127784
Synonyms:
CHEMBL48801 | N-[2-(2,2,2-Trifluoro-1-hydroxy-1-trifluoromethyl-ethyl)-naphthalen-1-yl]-4-trifluoromethyl-benzamide
Type:
Small organic molecule
Emp. Form.:
C21H12F9NO2
Mol. Mass.:
481.3111
SMILES:
OC(c1ccc2ccccc2c1NC(=O)c1ccc(cc1)C(F)(F)F)(C(F)(F)F)C(F)(F)F
: