Target
Lanosterol synthase
Ligand
BDBM50128061
Substrate
Meas. Tech.
ChEMBL_148897 (CHEMBL754981)
IC50
22±n/a nM
Citation
 Lenhart, AReinert, DJAebi, JDDehmlow, HMorand, OHSchulz, GE Binding structures and potencies of oxidosqualene cyclase inhibitors with the homologous squalene-hopene cyclase. J Med Chem 46:2083-92 (2003)  
Target
Name:
Lanosterol synthase
Synonyms:
2,3-epoxysqualene--lanosterol cyclase LSS_HUMAN Oxidosqualene--lanosterol cyclase
Type:
PROTEIN
Mol. Mass.:
83309.32
Organism:
Homo sapiens (Human)
Description:
ChEMBL_11231
Residue:
732
  
Inhibitor
Name:
BDBM50128061
Synonyms:
(4-Bromo-phenyl)-(4-{2-[(cyclopropyl-methyl-amino)-methyl]-cyclopropylmethoxy}-phenyl)-methanone N-(((1S,2S)-2-((4-(4-bromobenzoyl)phenoxy)methyl)cyclopropyl)methyl)-N-methylcyclopropanaminium
Type:
Small organic molecule
Emp. Form.:
C22H24BrNO2
Mol. Mass.:
414.335
SMILES:
CN(C[C@H]1C[C@@H]1COc1ccc(cc1)C(=O)c1ccc(Br)cc1)C1CC1
: