Target
Lanosterol synthase
Ligand
BDBM50128063
Substrate
Meas. Tech.
ChEMBL_148897 (CHEMBL754981)
IC50
2.9±n/a nM
Citation
 Lenhart, AReinert, DJAebi, JDDehmlow, HMorand, OHSchulz, GE Binding structures and potencies of oxidosqualene cyclase inhibitors with the homologous squalene-hopene cyclase. J Med Chem 46:2083-92 (2003)  
Target
Name:
Lanosterol synthase
Synonyms:
2,3-epoxysqualene--lanosterol cyclase LSS_HUMAN Oxidosqualene--lanosterol cyclase
Type:
PROTEIN
Mol. Mass.:
83309.32
Organism:
Homo sapiens (Human)
Description:
ChEMBL_11231
Residue:
732
  
Inhibitor
Name:
BDBM50128063
Synonyms:
Allyl-{6-[3-(4-bromo-phenyl)-benzo[d]isothiazol-6-yloxy]-hexyl}-methyl-amine CHEMBL67133 N-allyl-6-(3-(4-bromophenyl)benzo[d]isothiazol-6-yloxy)-N-methylhexan-1-aminium
Type:
Small organic molecule
Emp. Form.:
C23H27BrN2OS
Mol. Mass.:
459.442
SMILES:
CN(CCCCCCOc1ccc2c(nsc2c1)-c1ccc(Br)cc1)CC=C
: