Target
Fatty-acid amide hydrolase 1 [30-579]
Ligand
BDBM50128585
Substrate
Meas. Tech.
ChEMBL_68638 (CHEMBL857374)
IC50
63±n/a nM
Citation
 Tarzia, GDuranti, ATontini, APiersanti, GMor, MRivara, SPlazzi, PVPark, CKathuria, SPiomelli, D Design, synthesis, and structure-activity relationships of alkylcarbamic acid aryl esters, a new class of fatty acid amide hydrolase inhibitors. J Med Chem 46:2352-60 (2003)  
Target
Name:
Fatty-acid amide hydrolase 1 [30-579]
Synonyms:
Anandamide amidohydrolase 1 Faah Fatty Acid Amide Hydrolase Fatty-acid amide hydrolase (FAAH) Fatty-acid amide hydrolase 1 (FAAH) Oleamide hydrolase 1
Type:
Single-pass membrane protein; homodimer
Mol. Mass.:
60474.00
Organism:
Rattus norvegicus (rat)
Description:
P97612 (aa 30-579)
Residue:
550
  
Inhibitor
Name:
BDBM50128585
Synonyms:
CHEMBL431202 URB524 cyclohexylcarbamic acidbiphenyl-3-yl ester
Type:
Small organic molecule
Emp. Form.:
C19H21NO2
Mol. Mass.:
295.3755
SMILES:
O=C(NC1CCCCC1)Oc1cccc(c1)-c1ccccc1
: