Target
Carbonic anhydrase 1
Ligand
BDBM50564902
Substrate
Meas. Tech.
ChEMBL_2089633 (CHEMBL4770896)
Ki
18340±n/a nM
Citation
 Elzahhar, PAAbd El Wahab, SMElagawany, MDaabees, HBelal, ASFEl-Yazbi, AFEid, AHAlaaeddine, RHegazy, RRAllam, RMHelmy, MWBahaa Elgendy, naAngeli, AEl-Hawash, SASupuran, CT Expanding the anticancer potential of 1,2,3-triazoles via simultaneously targeting Cyclooxygenase-2, 15-lipoxygenase and tumor-associated carbonic anhydrases. Eur J Med Chem 200:0 (2020)  
Target
Name:
Carbonic anhydrase 1
Synonyms:
CA-I CAB Carbonate dehydratase I Carbonic anhydrase 1 (CA I) Carbonic anhydrase 1 (Recombinant CA I) Carbonic anhydrase B Carbonic anhydrase I (CA I) Carbonic anhydrase I (CAI) Carbonic anhydrase isoenzyme I (hCA I) | hCA
Type:
Enzyme
Mol. Mass.:
28873.37
Organism:
Homo sapiens (Human)
Description:
P00915
Residue:
261
  
Inhibitor
Name:
BDBM50564902
Synonyms:
CHEMBL4788698
Type:
Small organic molecule
Emp. Form.:
C19H17N7O3S
Mol. Mass.:
423.448
SMILES:
Cc1c(nnn1-c1ccc(cc1)S(N)(=O)=O)-c1nn(cc1\C=N\O)-c1ccccc1
: