Target
Carbonic anhydrase 2
Ligand
BDBM50564898
Substrate
Meas. Tech.
ChEMBL_2089634 (CHEMBL4770897)
Ki
>100000±n/a nM
Citation
 Elzahhar, PAAbd El Wahab, SMElagawany, MDaabees, HBelal, ASFEl-Yazbi, AFEid, AHAlaaeddine, RHegazy, RRAllam, RMHelmy, MWBahaa Elgendy, naAngeli, AEl-Hawash, SASupuran, CT Expanding the anticancer potential of 1,2,3-triazoles via simultaneously targeting Cyclooxygenase-2, 15-lipoxygenase and tumor-associated carbonic anhydrases. Eur J Med Chem 200:0 (2020)  
Target
Name:
Carbonic anhydrase 2
Synonyms:
CA-II CAC Carbonate dehydratase II Carbonic anhydrase 2 (CA-II) Carbonic anhydrase C Carbonic anhydrase II (CA-II) Carbonic anhydrase II (hCA II) | Carbonic anhydrase isoenzyme II (hCA II)
Type:
Enzyme
Mol. Mass.:
29250.71
Organism:
Homo sapiens (Human)
Description:
P00918
Residue:
260
  
Inhibitor
Name:
BDBM50564898
Synonyms:
CHEMBL4794089
Type:
Small organic molecule
Emp. Form.:
C23H19ClN8O2S3
Mol. Mass.:
571.097
SMILES:
C\C(=N/Nc1nc(cs1)-c1ccc(Cl)cc1)c1nnn(c1C)-c1ccc(cc1)S(=O)(=O)Nc1nccs1
: