Target
Carbonic anhydrase 2
Ligand
BDBM50564901
Substrate
Meas. Tech.
ChEMBL_2089634 (CHEMBL4770897)
Ki
239±n/a nM
Citation
 Elzahhar, PAAbd El Wahab, SMElagawany, MDaabees, HBelal, ASFEl-Yazbi, AFEid, AHAlaaeddine, RHegazy, RRAllam, RMHelmy, MWBahaa Elgendy, naAngeli, AEl-Hawash, SASupuran, CT Expanding the anticancer potential of 1,2,3-triazoles via simultaneously targeting Cyclooxygenase-2, 15-lipoxygenase and tumor-associated carbonic anhydrases. Eur J Med Chem 200:0 (2020)  
Target
Name:
Carbonic anhydrase 2
Synonyms:
CA-II CAC Carbonate dehydratase II Carbonic anhydrase 2 (CA-II) Carbonic anhydrase C Carbonic anhydrase II (CA-II) Carbonic anhydrase II (hCA II) | Carbonic anhydrase isoenzyme II (hCA II)
Type:
Enzyme
Mol. Mass.:
29250.71
Organism:
Homo sapiens (Human)
Description:
P00918
Residue:
260
  
Inhibitor
Name:
BDBM50564901
Synonyms:
CHEMBL4781301
Type:
Small organic molecule
Emp. Form.:
C20H16N6O3
Mol. Mass.:
388.3794
SMILES:
Cc1c(nnn1-c1ccc(cc1)C(O)=O)-c1nn(cc1\C=N\O)-c1ccccc1
: