Target
Carbonic anhydrase 9
Ligand
BDBM50564911
Substrate
Meas. Tech.
ChEMBL_2089635 (CHEMBL4770898)
Ki
9118±n/a nM
Citation
 Elzahhar, PAAbd El Wahab, SMElagawany, MDaabees, HBelal, ASFEl-Yazbi, AFEid, AHAlaaeddine, RHegazy, RRAllam, RMHelmy, MWBahaa Elgendy, naAngeli, AEl-Hawash, SASupuran, CT Expanding the anticancer potential of 1,2,3-triazoles via simultaneously targeting Cyclooxygenase-2, 15-lipoxygenase and tumor-associated carbonic anhydrases. Eur J Med Chem 200:0 (2020)  
Target
Name:
Carbonic anhydrase 9
Synonyms:
CA-IX CAH9_HUMAN Carbonic anhydrase 9 (CA IX) Carbonic anhydrase 9 precursor Carbonic anhydrase IX (CAIX) Carbonic anhydrases; II & IX MN RCC-associated antigen G250
Type:
Enzyme
Mol. Mass.:
49669.03
Organism:
Homo sapiens (Human)
Description:
Catalytic domain of human cloned isozyme was used in the assay
Residue:
459
  
Inhibitor
Name:
BDBM50564911
Synonyms:
CHEMBL4786755
Type:
Small organic molecule
Emp. Form.:
C11H12N4O3S
Mol. Mass.:
280.303
SMILES:
CC(=O)c1nnn(c1C)-c1ccc(cc1)S(N)(=O)=O
: