Target
Carbonic anhydrase 9
Ligand
BDBM50564897
Substrate
Meas. Tech.
ChEMBL_2089635 (CHEMBL4770898)
Ki
7893±n/a nM
Citation
 Elzahhar, PAAbd El Wahab, SMElagawany, MDaabees, HBelal, ASFEl-Yazbi, AFEid, AHAlaaeddine, RHegazy, RRAllam, RMHelmy, MWBahaa Elgendy, naAngeli, AEl-Hawash, SASupuran, CT Expanding the anticancer potential of 1,2,3-triazoles via simultaneously targeting Cyclooxygenase-2, 15-lipoxygenase and tumor-associated carbonic anhydrases. Eur J Med Chem 200:0 (2020)  
Target
Name:
Carbonic anhydrase 9
Synonyms:
CA-IX CAH9_HUMAN Carbonic anhydrase 9 (CA IX) Carbonic anhydrase 9 precursor Carbonic anhydrase IX (CAIX) Carbonic anhydrases; II & IX MN RCC-associated antigen G250
Type:
Enzyme
Mol. Mass.:
49669.03
Organism:
Homo sapiens (Human)
Description:
Catalytic domain of human cloned isozyme was used in the assay
Residue:
459
  
Inhibitor
Name:
BDBM50564897
Synonyms:
CHEMBL4780406
Type:
Small organic molecule
Emp. Form.:
C20H18ClN7O2S2
Mol. Mass.:
487.986
SMILES:
C\C(=N/Nc1nc(cs1)-c1ccc(Cl)cc1)c1nnn(c1C)-c1ccc(cc1)S(N)(=O)=O
: