Target
Carbonic anhydrase 12
Ligand
BDBM50564913
Substrate
Meas. Tech.
ChEMBL_2089636 (CHEMBL4770899)
Ki
20±n/a nM
Citation
 Elzahhar, PAAbd El Wahab, SMElagawany, MDaabees, HBelal, ASFEl-Yazbi, AFEid, AHAlaaeddine, RHegazy, RRAllam, RMHelmy, MWBahaa Elgendy, naAngeli, AEl-Hawash, SASupuran, CT Expanding the anticancer potential of 1,2,3-triazoles via simultaneously targeting Cyclooxygenase-2, 15-lipoxygenase and tumor-associated carbonic anhydrases. Eur J Med Chem 200:0 (2020)  
Target
Name:
Carbonic anhydrase 12
Synonyms:
CA-XII CAH12_HUMAN Carbonic anhydrase Carbonic anhydrase XII Carbonic anhydrase XII (CAXII) | Tumor antigen HOM-RCC-3.1.3
Type:
Enzyme
Mol. Mass.:
39456.00
Organism:
Homo sapiens (Human)
Description:
Catalytic domain of human cloned isozyme was used in the assay
Residue:
354
  
Inhibitor
Name:
BDBM50564913
Synonyms:
CHEMBL4795119
Type:
Small organic molecule
Emp. Form.:
C12H15N7O3S
Mol. Mass.:
337.358
SMILES:
C\C(=N/NC(N)=O)c1nnn(c1C)-c1ccc(cc1)S(N)(=O)=O
: