Target
M-phase inducer phosphatase 3
Ligand
BDBM50129581
Substrate
Meas. Tech.
ChEMBL_49190 (CHEMBL662118)
IC50
11000±n/a nM
Citation
 Sohn, JKiburz, BLi, ZDeng, LSafi, APirrung, MCRudolph, J Inhibition of Cdc25 phosphatases by indolyldihydroxyquinones. J Med Chem 46:2580-8 (2003)  
Target
Name:
M-phase inducer phosphatase 3
Synonyms:
CDC25C M-phase inducer phosphatase 3 | MPIP3_HUMAN
Type:
Substrate
Mol. Mass.:
53366.11
Organism:
Homo sapiens (Human)
Description:
P30307
Residue:
473
  
Inhibitor
Name:
BDBM50129581
Synonyms:
3-[6-Chloro-7-(3-methyl-but-2-enyl)-1H-indol-3-yl]-2,5-dihydroxy-[1,4]benzoquinone | CHEMBL315566
Type:
Small organic molecule
Emp. Form.:
C19H16ClNO4
Mol. Mass.:
357.788
SMILES:
CC(C)=CCc1c(Cl)ccc2c(c[nH]c12)C1C(=O)C(=O)CC(=O)C1=O
: