Target
M-phase inducer phosphatase 2
Ligand
BDBM50129581
Substrate
Meas. Tech.
ChEMBL_49025 (CHEMBL662064)
IC50
7200±n/a nM
Citation
 Sohn, JKiburz, BLi, ZDeng, LSafi, APirrung, MCRudolph, J Inhibition of Cdc25 phosphatases by indolyldihydroxyquinones. J Med Chem 46:2580-8 (2003)  
Target
Name:
M-phase inducer phosphatase 2
Synonyms:
CDC25B Dual specificity phosphatase (CDC25B) M-phase inducer phosphatase 2 (CDC25B) | MPIP2_HUMAN
Type:
Protein
Mol. Mass.:
64985.27
Organism:
Homo sapiens (Human)
Description:
Residue:
580
  
Inhibitor
Name:
BDBM50129581
Synonyms:
3-[6-Chloro-7-(3-methyl-but-2-enyl)-1H-indol-3-yl]-2,5-dihydroxy-[1,4]benzoquinone | CHEMBL315566
Type:
Small organic molecule
Emp. Form.:
C19H16ClNO4
Mol. Mass.:
357.788
SMILES:
CC(C)=CCc1c(Cl)ccc2c(c[nH]c12)C1C(=O)C(=O)CC(=O)C1=O
: