Target
Acetylcholinesterase
Ligand
BDBM50565698
Substrate
Meas. Tech.
ChEMBL_2093130 (CHEMBL4774393)
IC50
28980±n/a nM
Citation
 Santi, MDArredondo, FCarvalho, DEcheverry, CPrunell, GPeralta, MACabrera, JLOrtega, MGSavio, EAbin-Carriquiry, JA Neuroprotective effects of prenylated flavanones isolated from Dalea species, in vitro and in silico studies. Eur J Med Chem 206:0 (2020)  
Target
Name:
Acetylcholinesterase
Synonyms:
ACES_HUMAN Acetylcholinesterase (AChE) | Acetylcholinesterase (human AChE)
Type:
Enzyme
Mol. Mass.:
67792.70
Organism:
Homo sapiens (Human)
Description:
P22303
Residue:
614
  
Inhibitor
Name:
BDBM50565698
Synonyms:
CHEMBL3085398
Type:
Small organic molecule
Emp. Form.:
C25H28O6
Mol. Mass.:
424.4862
SMILES:
[#6]\[#6](-[#6])=[#6]\[#6]-c1c(-[#8])cc(-[#8])c2-[#6](=O)-[#6]-[#6@H](-[#8]-c12)-c1cc(c(-[#8])cc1-[#8])C([#6])([#6])[#6]=[#6]
: