Target
NT-3 growth factor receptor
Ligand
BDBM50565738
Substrate
Meas. Tech.
ChEMBL_2093490 (CHEMBL4774753)
EC50
29±n/a nM
Citation
 Wang, BZhang, WLiu, XZou, FWang, JLiu, QWang, AHu, ZChen, YQi, SJiang, ZChen, CHu, CWang, LWang, WLiu, QLiu, J Discovery of (E)-N-(4-methyl-5-(3-(2-(pyridin-2-yl)vinyl)-1H-indazol-6-yl)thiazol-2-yl)-2-(4-methylpiperazin-1-yl)acetamide (IHMT-TRK-284) as a novel orally available type II TRK kinase inhibitor capable of overcoming multiple resistant mutants. Eur J Med Chem 207:0 (2020)  
Target
Name:
NT-3 growth factor receptor
Synonyms:
GP145-TrkC NTRK3_HUMAN Neurotrophic tyrosine kinase receptor type 3 Trk-C Tyrosine kinase receptor C (Trk-C)
Type:
Enzyme
Mol. Mass.:
94428.15
Organism:
Homo sapiens (Human)
Description:
Q16288
Residue:
839
  
Inhibitor
Name:
BDBM50565738
Synonyms:
CHEMBL4794404
Type:
Small organic molecule
Emp. Form.:
C25H27N7OS
Mol. Mass.:
473.593
SMILES:
CN1CCN(CC(=O)Nc2nc(C)c(s2)-c2ccc3c(\C=C\c4ccccn4)n[nH]c3c2)CC1
: