Target
Beta-3 adrenergic receptor
Ligand
BDBM50075888
Substrate
Meas. Tech.
ChEMBL_38921 (CHEMBL652022)
EC50
100±n/a nM
Citation
 Kashaw, SKRathi, LMishra, PSaxena, AK Development of 3D-QSAR models in cyclic ureidobenzenesulfonamides: human beta3-adrenergic receptor agonist. Bioorg Med Chem Lett 13:2481-4 (2003)  
Target
Name:
Beta-3 adrenergic receptor
Synonyms:
ADRB3 ADRB3_HUMAN Beta-2 adrenergic receptor and beta-3 adrenergic receptor Beta-3 adrenoreceptor | adrenergic Beta3
Type:
G Protein-Coupled Receptor (GPCR)
Mol. Mass.:
43534.88
Organism:
Homo sapiens (Human)
Description:
Residue:
408
  
Inhibitor
Name:
BDBM50075888
Synonyms:
4-(1-Hexyl-5-oxo-1,5-dihydro-[1,2,4]triazol-4-yl)-N-{4-[2-((R)-2-hydroxy-2-pyridin-3-yl-ethylamino)-ethyl]-phenyl}-benzenesulfonamide CHEMBL314893
Type:
Small organic molecule
Emp. Form.:
C29H36N6O4S
Mol. Mass.:
564.699
SMILES:
CCCCCCn1ncn(-c2ccc(cc2)S(=O)(=O)Nc2ccc(CCNC[C@H](O)c3cccnc3)cc2)c1=O
: