Target
Genome polyprotein
Ligand
BDBM50131392
Substrate
Meas. Tech.
ChEMBL_143492 (CHEMBL755948)
IC50
330±n/a nM
Citation
 Orvieto, FKoch, UMatassa, VGMuraglia, E Novel, potent phenethylamide inhibitors of the hepatitis C virus (HCV) NS3 protease: probing the role of P2 aryloxyprolines with hybrid structures. Bioorg Med Chem Lett 13:2745-8 (2003)  
Target
Name:
Genome polyprotein
Synonyms:
Hepatitis C virus NS3 protease/helicase | Hepatitis C virus serine protease, NS3/NS4A
Type:
Protein
Mol. Mass.:
67067.41
Organism:
Hepatitis C virus
Description:
A3EZI9
Residue:
631
  
Inhibitor
Name:
BDBM50131392
Synonyms:
(R)-1-{[(R)-1-((S)-2-tert-Butoxycarbonylamino-3,3-dimethyl-butyryl)-4-(quinolin-4-yloxy)-pyrrolidine-2-carbonyl]-amino}-2-vinyl-cyclopropanecarboxylic acid | CHEMBL330117
Type:
Small organic molecule
Emp. Form.:
C31H40N4O7
Mol. Mass.:
580.6719
SMILES:
CC(C)(C)OC(=O)N[C@H](C(=O)N1C[C@@H](CC1C(=O)N[C@@]1(CC1C=C)C(O)=O)Oc1ccnc2ccccc12)C(C)(C)C
: