Target
Interstitial collagenase
Ligand
BDBM50131533
Substrate
Meas. Tech.
ChEMBL_106295 (CHEMBL714551)
IC50
33±n/a nM
Citation
 Levin, JIChen, JMCheung, KCole, DCrago, CSantos, EDDu, XKhafizova, GMacEwan, GNiu, CSalaski, EJZask, ACummons, TSung, AXu, JZhang, YXu, WAyral-Kaloustian, SJin, GCowling, RBarone, DMohler, KMBlack, RASkotnicki, JS Acetylenic TACE inhibitors. Part 1. SAR of the acyclic sulfonamide hydroxamates. Bioorg Med Chem Lett 13:2799-803 (2003)  
Target
Name:
Interstitial collagenase
Synonyms:
CLG MMP1 Matrix metalloproteinase-1 | Matrix metalloproteinase-1 (MMP-1)
Type:
Enzyme
Mol. Mass.:
54010.26
Organism:
Homo sapiens (Human)
Description:
P03956
Residue:
469
  
Inhibitor
Name:
BDBM50131533
Synonyms:
3-[(4-But-2-ynyloxy-benzenesulfonyl)-methyl-amino]-N-hydroxy-propionamide | CHEMBL96419
Type:
Small organic molecule
Emp. Form.:
C14H18N2O5S
Mol. Mass.:
326.368
SMILES:
CC#CCOc1ccc(cc1)S(=O)(=O)N(C)CCC(=O)NO
: