Target
Disintegrin and metalloproteinase domain-containing protein 17
Ligand
BDBM50131533
Substrate
Meas. Tech.
ChEBML_212918
IC50
73±n/a nM
Citation
 Levin, JIChen, JMCheung, KCole, DCrago, CSantos, EDDu, XKhafizova, GMacEwan, GNiu, CSalaski, EJZask, ACummons, TSung, AXu, JZhang, YXu, WAyral-Kaloustian, SJin, GCowling, RBarone, DMohler, KMBlack, RASkotnicki, JS Acetylenic TACE inhibitors. Part 1. SAR of the acyclic sulfonamide hydroxamates. Bioorg Med Chem Lett 13:2799-803 (2003)  
Target
Name:
Disintegrin and metalloproteinase domain-containing protein 17
Synonyms:
ADA17_HUMAN CSVP Disintegrin and metalloproteinase domain-containing protein 17 (ADAM17) TNF-alpha convertase TNF-alpha-converting enzyme (TACE) Tumor necrosis factor-α converting enzyme (TACE)
Type:
Enzyme
Mol. Mass.:
93007.89
Organism:
Homo sapiens (Human)
Description:
Residue:
824
  
Inhibitor
Name:
BDBM50131533
Synonyms:
3-[(4-But-2-ynyloxy-benzenesulfonyl)-methyl-amino]-N-hydroxy-propionamide | CHEMBL96419
Type:
Small organic molecule
Emp. Form.:
C14H18N2O5S
Mol. Mass.:
326.368
SMILES:
CC#CCOc1ccc(cc1)S(=O)(=O)N(C)CCC(=O)NO
: