Target
Retinoic acid receptor RXR-alpha
Ligand
BDBM50132582
Substrate
Meas. Tech.
ChEMBL_196770 (CHEMBL798931)
Ki
5208±n/a nM
Citation
 Gernert, DLAjamie, RArdecky, RABell, MGLeibowitz, MDMais, DAMapes, CMMichellys, PYRungta, DReifel-Miller, ATyhonas, JSYumibe, NGrese, TA Design and synthesis of fluorinated RXR modulators. Bioorg Med Chem Lett 13:3191-5 (2003)  
Target
Name:
Retinoic acid receptor RXR-alpha
Synonyms:
NR2B1 Nuclear receptor subfamily 4 group A member 2 RXRA Retinoic acid receptor RXR-alpha/gamma Retinoid receptor
Type:
PROTEIN
Mol. Mass.:
50820.38
Organism:
Homo sapiens (Human)
Description:
ChEMBL_1456363
Residue:
462
  
Inhibitor
Name:
BDBM50132582
Synonyms:
(2Z,4E,6Z)-7-(2-Butoxy-3,5-di-tert-butyl-phenyl)-3-trifluoromethyl-octa-2,4,6-trienoic acid | CHEMBL107554
Type:
Small organic molecule
Emp. Form.:
C27H37F3O3
Mol. Mass.:
466.5761
SMILES:
CCCCOc1c(cc(cc1C(C)(C)C)C(C)(C)C)C(\C)=C/C=C/C(=C/C(O)=O)/C(F)(F)F
: