Target
Sodium-dependent noradrenaline transporter
Ligand
BDBM50132688
Substrate
Meas. Tech.
ChEMBL_142778 (CHEMBL883548)
Ki
183±n/a nM
Citation
 Axford, LBoot, JRHotten, TMKeenan, MMartin, FMMilutinovic, SMoore, NAO'Neill, MFPullar, IATupper, DEVan Belle, KRVivien, V Bicyclo[2.2.1]heptanes as novel triple re-uptake inhibitors for the treatment of depression. Bioorg Med Chem Lett 13:3277-80 (2003)  
Target
Name:
Sodium-dependent noradrenaline transporter
Synonyms:
Monoamine transporter NET Noradrenaline Transporter (NET) Norepinephrine transporter protein (NET) SLC6A2 Sodium-dependent noradrenaline transporter (NET) | Solute carrier family 6 member 2
Type:
Multi-pass membrane protein
Mol. Mass.:
69337.72
Organism:
Homo sapiens (Human)
Description:
P23975
Residue:
617
  
Inhibitor
Name:
BDBM50132688
Synonyms:
CHEMBL323447 | Dimethyl-(3-naphthalen-1-yl-bicyclo[2.2.1]hept-2-ylmethyl)-amine
Type:
Small organic molecule
Emp. Form.:
C20H25N
Mol. Mass.:
279.4192
SMILES:
CN(C)CC1C2CCC(C2)C1c1cccc2ccccc12
: