Target
Sodium-dependent serotonin transporter
Ligand
BDBM50132681
Substrate
Meas. Tech.
ChEMBL_202161 (CHEMBL808864)
Ki
25±n/a nM
Citation
 Axford, LBoot, JRHotten, TMKeenan, MMartin, FMMilutinovic, SMoore, NAO'Neill, MFPullar, IATupper, DEVan Belle, KRVivien, V Bicyclo[2.2.1]heptanes as novel triple re-uptake inhibitors for the treatment of depression. Bioorg Med Chem Lett 13:3277-80 (2003)  
Target
Name:
Sodium-dependent serotonin transporter
Synonyms:
5-HT Transporter 5HTT SC6A4_HUMAN SLC6A4 Serotonin transporter (5HTT) Sodium-dependent serotonin transporter (SERT) | Solute carrier family 6 member 4
Type:
Multi-pass membrane protein
Mol. Mass.:
70322.51
Organism:
Homo sapiens (Human)
Description:
P31645
Residue:
630
  
Inhibitor
Name:
BDBM50132681
Synonyms:
CHEMBL323678 | [(2S,3S)-3-(6-Methoxy-naphthalen-2-yl)-bicyclo[2.2.1]hept-2-ylmethyl]-dimethyl-amine
Type:
Small organic molecule
Emp. Form.:
C21H27NO
Mol. Mass.:
309.4452
SMILES:
COc1ccc2cc(ccc2c1)[C@H]1C2CCC(C2)[C@@H]1CN(C)C
: