Target
Sodium-dependent noradrenaline transporter
Ligand
BDBM50132687
Substrate
Meas. Tech.
ChEMBL_142778 (CHEMBL883548)
Ki
385±n/a nM
Citation
 Axford, LBoot, JRHotten, TMKeenan, MMartin, FMMilutinovic, SMoore, NAO'Neill, MFPullar, IATupper, DEVan Belle, KRVivien, V Bicyclo[2.2.1]heptanes as novel triple re-uptake inhibitors for the treatment of depression. Bioorg Med Chem Lett 13:3277-80 (2003)  
Target
Name:
Sodium-dependent noradrenaline transporter
Synonyms:
Monoamine transporter NET Noradrenaline Transporter (NET) Norepinephrine transporter protein (NET) SLC6A2 Sodium-dependent noradrenaline transporter (NET) | Solute carrier family 6 member 2
Type:
Multi-pass membrane protein
Mol. Mass.:
69337.72
Organism:
Homo sapiens (Human)
Description:
P23975
Residue:
617
  
Inhibitor
Name:
BDBM50132687
Synonyms:
CHEMBL324269 | [(2S,3S)-3-(6-Fluoro-naphthalen-2-yl)-bicyclo[2.2.1]hept-2-ylmethyl]-dimethyl-amine
Type:
Small organic molecule
Emp. Form.:
C20H24FN
Mol. Mass.:
297.4097
SMILES:
CN(C)C[C@H]1C2CCC(C2)[C@@H]1c1ccc2cc(F)ccc2c1
: